Welcome, Guest. Please login or register.

Author Topic: Compile Error. v2  (Read 3244 times)

0 Members and 1 Guest are viewing this topic.

Somnus

  • Guest
Compile Error. v2
« on: October 01, 2013, 08:30:03 pm »
Code: [Select]
Version:
     [exec] Result: 1
     [exec] Result: 1
     [echo] version = svn: E This client is too old to work with the working copy at
     [echo] 'C:\workspace_l2jhellas\L2JHellasC' (format 31).
     [echo] You need to get a newer Subversion client. For more details, see
     [echo]   http://subversion.apache.org/faq.html#working-copy-format-change
Compile:
     [echo] Compiling L2J Hellas.

Code: [Select]
BUILD FAILED
C:\workspace_l2jhellas\L2JHellasC\build.xml:212: Failed to create missing parent directory for C:\workspace_l2jhellas\build\Core\L2J_Hellas_Core_svn: E This client is too old to work with the working copy at
'C:\workspace_l2jhellas\L2JHellasC' (format 31).
You need to get a newer Subversion client. For more details, see
  http:\subversion.apache.org\faq.html#working-copy-format-change
.zip

Total time: 44 seconds

1) jdk 1.7 installed
2) Slik-Subversion 1.7.7 for 32Bit Windows versions (installed)
3) Slik-Subversion 1.8.3.1 for 32Bit Windows versions (installed) / previous version deleted.
4) Subversion-client 1.7.8-1 for 32Bit Windows versions (installed)
5) Subversion-client 1.8.3 for 32Bit Windows versions (installed) / previous version deleted.
« Last Edit: October 01, 2013, 08:43:21 pm by Somnus »

.i.

  • Guest
Re: Compile Error. v2
« Reply #1 on: October 01, 2013, 09:07:19 pm »
let me  give you  a solution

I had the same error and Nightwolf fixed it for me via teamwiwer but I don't know what he did because probably he was after amphetamine and go all so fast and I was  confused so I delete eclipse and try  do it myself the instal jdk 7 and  Slik-Subversion 1.7.7 for 32Bit Windows after subclipse  1.4 the error work like a charm then I upgrade subclipse  from 1.4 to 1.8  and after all work fine so I think Nightwolf do something the same but in another way 
anyway
here is full rar in order to fix it  Take me baby

after it just go to eclipse  and click "help"


then



next


then type Subclipse and instal this rev 

Code: [Select]
http://subclipse.tigris.org/update_1.8.x


and next u just  fallow the steps to install



« Last Edit: October 01, 2013, 09:30:48 pm by .i. »

Offline Nightwolf

  • Dalek
  • L2jHellas User
  • *
  • Posts: 784
  • Country: gr
  • Karma: 13
  • Exterminate!!!
Re: Compile Error. v2
« Reply #2 on: October 01, 2013, 10:11:44 pm »
as .i. said this is the solution
but i recommend eclipse juno version
it has in help the "marketplace" that you can select the subclipse in search and install it so simple
and after all its good to learn how to fix your eclipse its a program you need to learn after all :)
PS:
1) jdk 1.7 installed
2) Slik-Subversion 1.7.7 for 32Bit Windows versions (installed)
3) Slik-Subversion 1.8.3.1 for 32Bit Windows versions (installed) / previous version deleted.
4) Subversion-client 1.7.8-1 for 32Bit Windows versions (installed)
5) Subversion-client 1.8.3 for 32Bit Windows versions (installed) / previous version deleted.
all this are not needed except 1 ^^ if you do as .i. said

Somnus

  • Guest
Re: Compile Error. v2
« Reply #3 on: October 01, 2013, 10:59:45 pm »
Well both of suggestions are done already.

Before i post my problem i had try with 1.6 - 1.8 - 1.10.

Also jdk1.7 is fine i guess, cause i use it on other project too and its ok.


EDIT: I download again all of them , to check if there will be the same error again.

Offline Nightwolf

  • Dalek
  • L2jHellas User
  • *
  • Posts: 784
  • Country: gr
  • Karma: 13
  • Exterminate!!!
Re: Compile Error. v2
« Reply #4 on: October 01, 2013, 11:30:57 pm »
uninstall any subversion you have and silk also
reboot
download eclipse Juno
install subclipse by help->marketplace->search (type subclipse) ->select option install
restart eclipse
select jdk on options on compile
go in view -> others select svn and repositories
add the svn link we have https://subversion.assembla.com/svn/l2hellas/
checkout
build
and it will work 101%

optional uninstall any jdk you already have and install the latest version

Somnus

  • Guest
Re: Compile Error. v2
« Reply #5 on: October 02, 2013, 02:05:54 am »
Now its ok. Thanks Nightwolf  8)

Something last...Is that any of my fault or pack got 45844 html problems? :P


Offline Nightwolf

  • Dalek
  • L2jHellas User
  • *
  • Posts: 784
  • Country: gr
  • Karma: 13
  • Exterminate!!!
Re: Compile Error. v2
« Reply #6 on: October 02, 2013, 04:06:11 am »
dont worry about the warnings (!) the htmls are working fine just the eclipse validator show you warnings of a real html document.

Somnus

  • Guest
Re: Compile Error. v2
« Reply #7 on: October 02, 2013, 04:07:26 am »
dont worry about the warnings (!) the htmls are working fine just the eclipse validator show you warnings of a real html document.
Ok mate. I'm glad to start some lessons with this project.

.i.

  • Guest
Re: Compile Error. v2
« Reply #8 on: October 02, 2013, 11:47:20 am »
Nightwolf  I have question  I try do like u say  I have juno but cannot find the marketplace  can u tell me your version ?





Thanks

Offline Nightwolf

  • Dalek
  • L2jHellas User
  • *
  • Posts: 784
  • Country: gr
  • Karma: 13
  • Exterminate!!!
Re: Compile Error. v2
« Reply #9 on: October 02, 2013, 12:35:36 pm »
Java IDE developers search that.

DennisGR

  • Guest
Re: Compile Error. v2
« Reply #10 on: November 13, 2013, 02:57:25 pm »
i have this problem
Code: [Select]
Buildfile: D:\workspace\L2JHellasC\build.xml
     [echo] Building L2j Hellas.
Clean:
   [delete] Deleting directory D:\workspace\build\Core
Building Dirs:
    [mkdir] Created dir: D:\workspace\build\Core
    [mkdir] Created dir: D:\workspace\build\Core\classes
    [mkdir] Created dir: D:\workspace\build\Core\dist
    [mkdir] Created dir: D:\workspace\build\Core\dist\doc
    [mkdir] Created dir: D:\workspace\build\Core\dist\doc\3rdPartyLicenses
    [mkdir] Created dir: D:\workspace\build\Core\dist\login
    [mkdir] Created dir: D:\workspace\build\Core\dist\gameserver
    [mkdir] Created dir: D:\workspace\build\Core\dist\libs
Version:

BUILD FAILED
D:\workspace\L2JHellasC\build.xml:224: Execute failed: java.io.IOException: Cannot run program "svn": CreateProcess error=2, ??? ????? ?????? ? ?????? ??? ???????????? ??????? ??? ?? ???????

Total time: 466 milliseconds

nitzamc

  • Guest
Re: Compile Error. v2
« Reply #11 on: November 13, 2013, 08:10:46 pm »
same error with dennis

Offline Nightwolf

  • Dalek
  • L2jHellas User
  • *
  • Posts: 784
  • Country: gr
  • Karma: 13
  • Exterminate!!!
Re: Compile Error. v2
« Reply #12 on: November 13, 2013, 09:57:07 pm »
read the forums....
http://l2jhellas.eu/index.php?topic=85.0
locked to avoid spam